*HEADING
Bolt head trimming
Units (ton, mm, s, N)
*Preprint, ECHO=YES, model=NO, history=YES, contact=NO
**
** Definice modelu
**
*NODE, NSET=NALL
*ELEMENT, TYPE=CAX4R, ELSET=VZOREK
**
** Definice
**
*NSET, NSET=SPODEK-UY
*NSET, NSET=VRCH-SILA
**
**
**
*SOLID SECTION, ELSET=Vzorek, MATERIAL=PORUSOVANY
1.,
**
**
*MATERIAL, NAME=PORUSOVANY
*DENSITY
 7.85e-09,
*ELASTIC
210000., 0.3
*PLASTIC
395.,   0.
613.,  0.1
719.,  0.2
746., 0.25
773., 0.35
788.,  0.5
845.,  0.9
887.,  1.2
*SHEAR FAILURE, TYPE=TABULAR, ELEMENT DELETION=YES
**
*Boundary
SPODEK-UY, YSYMM
** Name: Vrchni profil Type: Displacement/Rotation
*Boundary
VRCH-SILA, 1
**
********************************************************************************
**                                   STEP                                     **
********************************************************************************
*STEP, NAME=Posuv
*DYNAMIC, EXPLICIT
, 0.02
*BULK VISCOSITY
**
**
*AMPLITUDE, NAME=RYCHLOST, DEFINITION=SMOOTH STEP
0.0,0.0     ,0.5E-03, 1.0
*BOUNDARY, TYPE=VELOCITY, AMPLITUDE=RYCHLOST
VRCH-SILA, 2, 2, 500.
**
**
*RESTART, WRITE, NUMBER INTERVAL=1
*OUTPUT, FIELD, NUMBER INTERVAL=40
*NODE OUTPUT
A, RF, U, V
*ELEMENT OUTPUT
S,LE, PE, PEEQ, STATUS
*CONTACT OUTPUT
CFORCE,CSTRESS
**
**
*OUTPUT, HISTORY, FREQUENCY=200
***CONTACT OUTPUT, CPSET=Sroub-deska
**CFN,CFS,CAREA
*INCREMENTATION OUTPUT
DT
*ENERGY OUTPUT
ALLAE, ALLIE, ALLWK, ALLDMD, ETOTAL
*END STEP