*HEADING
Vystrihovani kruhove diry
Units (ton, mm, s, N)
*Preprint, ECHO=YES, model=NO, history=YES, contact=NO
**
** Definice modelu
**
*NODE, NSET=NALL
*ELEMENT, TYPE=CAX4R, ELSET=PLECH
*ELEMENT, TYPE=CAX4R, ELSET=STRIZNIK
*ELEMENT, TYPE=CAX4R, ELSET=PRIDRZOVAC
*ELEMENT, TYPE=CAX4R, ELSET=STRIZNICE
**
**  Definice povrchu
**
*SURFACE, TYPE=ELEMENT, NAME=PLECH
PLECH,
*SURFACE, TYPE=ELEMENT, NAME=STRIZNIK
STRIZNIK,
*SURFACE, TYPE=ELEMENT, NAME=PRIDRZOVAC
PRIDRZOVAC,
*SURFACE, TYPE=ELEMENT, NAME=STRIZNICE
STRIZNICE,
**
**
**
*SOLID SECTION, ELSET=PLECH, MATERIAL=PORUSOVANY
1.,
*SOLID SECTION, ELSET=STRIZNIK, MATERIAL=ELASTICKY
1.,
*SOLID SECTION, ELSET=PRIDRZOVAC, MATERIAL=ELASTICKY
1.,
*SOLID SECTION, ELSET=STRIZNICE, MATERIAL=ELASTICKY
1.,
*RIGID BODY, REF NODE=1311, ELSET=STRIZNIK
*RIGID BODY, REF NODE=1470, ELSET=PRIDRZOVAC
*RIGID BODY, REF NODE=1629, ELSET=STRIZNICE
**
**
**
*MATERIAL, NAME=PORUSOVANY
*DENSITY
   7.85e-06,
*ELASTIC
   210000., 0.3
*PLASTIC
   395.,   0.
   613.,  0.1
   719.,  0.2
   746., 0.25
   773., 0.35
   788.,  0.5
   845.,  0.9
   887.,  1.2
*SHEAR FAILURE, TYPE=TABULAR, ELEMENT DELETION=YES
*MATERIAL, NAME=ELASTICKY
*DENSITY
 7.85e-06,
*ELASTIC
210000., 0.3
**
**
**
*SURFACE INTERACTION, NAME=TRENI
*Friction, exponential decay
0.15, 0.15, 1.
**
**
** BOUNDARY CONDITIONS
** Name: Striznik-UX,ROTZ Type: Displacement/Rotation
*Boundary
1311, 1
1311, 6
** Name: Pridrzovac-vetknuti Type: Symmetry/Antisymmetry/Encastre
*Boundary
1470, ENCASTRE
** Name: Striznice-vetknuti Type: Symmetry/Antisymmetry/Encastre
*Boundary
1629, ENCASTRE
**----------------------------
*STEP, NAME=Posuv
*DYNAMIC, EXPLICIT
, 0.004
*BULK VISCOSITY
**
**
*AMPLITUDE, NAME=RYCHLOST, DEFINITION=SMOOTH STEP
0.0,0.0     ,5.0E-04, 1.0
*BOUNDARY, TYPE=VELOCITY, AMPLITUDE=RYCHLOST
1311, 2, 2, -500.
**
**
*CONTACT PAIR, INTERACTION=TRENI, MECHANICAL CONSTRAINT=KINEMATIC, cpset=Plech-Striznik
PLECH, STRIZNIK
*CONTACT PAIR, INTERACTION=TRENI, WEIGHT=0.0, cpset=Plech-Pridrzovac
PLECH, PRIDRZOVAC
*CONTACT PAIR, INTERACTION=TRENI, WEIGHT=0.0, cpset=Plech-Striznice
PLECH, STRIZNICE
**
**
**
*RESTART, WRITE, NUMBER INTERVAL=1
*OUTPUT, FIELD, NUMBER INTERVAL=40
*NODE OUTPUT
A, RF, U, V
*ELEMENT OUTPUT
S,LE, PE, PEEQ, STATUS
*CONTACT OUTPUT
CFORCE,CSTRESS
**
**
*OUTPUT, HISTORY, FREQUENCY=200
*CONTACT OUTPUT, CPSET=Plech-Striznik
CFN,CFS,CAREA
*INCREMENTATION OUTPUT
DT
*ENERGY OUTPUT
ALLAE, ALLIE, ALLWK, ALLDMD, ETOTAL
*END STEP